BDBM336480 US9744172, Compound UNC1280A
SMILES CCCCNc1ncc2c(nn(C3CC[C@H](O)CC3)c2n1)-c1ccc(NC(=O)c2ccc(F)cc2)cc1
InChI Key InChIKey=MQDDNZQSOPLJSU-SAWYFRRKSA-N
Data  1 IC50
  Tab Delimited (TSV)   2D SDfile   Computed 3D by Vconf -m prep SDfile
Find this compound or compounds like it in BindingDB:
Activity Spreadsheet -- Enzyme Inhibition Constant Data from BindingDB
Found 1 hit for monomerid = 336480
TargetTyrosine-protein kinase Mer(Homo sapiens (Human))
University Of North Carolina At Chapel Hill
US Patent
LigandPNGBDBM336480(US9744172, Compound UNC1280A)
Affinity DataIC50:  55nM. Assay description: The ectopic expression of Mer receptor tyrosine kinase (Mer) has been identified as a tumor cell survival gene product in Acute Lymphoblastic Leukemi...
Ligand InfoPC cidPC sid
In DepthDetails US Patent