BDBM336693 US9745283, Example 122
SMILES COc1cc2nccc(Oc3ccc(NC(=O)c4nn(C)c(=O)n(CC#N)c4=O)cc3F)c2cc1OC
InChI Key InChIKey=WUERKMWYGWNNJC-UHFFFAOYSA-N
Data  1 IC50
  Tab Delimited (TSV)   2D SDfile   Computed 3D by Vconf -m prep SDfile
Find this compound or compounds like it in BindingDB:
Activity Spreadsheet -- Enzyme Inhibition Constant Data from BindingDB
Found 1 hit for monomerid = 336693
TargetTyrosine-protein kinase receptor UFO(Homo sapiens (Human))
Ignyta
US Patent
LigandPNGBDBM336693(US9745283, Example 122)
Affinity DataIC50:  550nM. Assay description: The ability of compounds to inhibit the kinase activity of recombinant human baculovirus-expressed AXL was measured by homogeneous TRF (HTRF) using C...
Ligand InfoPC cidPC sid
In DepthDetails US Patent