BDBM337752 Ethyl 1-{4-[(methoxycarbonyl)(methyl)amino]phenyl}-3-[2-methyl-3-(trifluoromethyl)benzyl]-2,4-dioxo-1,2,3,4-tetrahydropyrimidine-5-carboxylate::US9751843, 134
SMILES CCOC(=O)c1cn(-c2ccc(cc2)N(C)C(=O)OC)c(=O)n(Cc2cccc(c2C)C(F)(F)F)c1=O
InChI Key InChIKey=HXRVWWZFCQDRJK-UHFFFAOYSA-N
Data  1 IC50
  Tab Delimited (TSV)   2D SDfile   Computed 3D by Vconf -m prep SDfile
Find this compound or compounds like it in BindingDB:
Activity Spreadsheet -- Enzyme Inhibition Constant Data from BindingDB
Found 1 hit for monomerid = 337752
TargetChymase(Homo sapiens (Human))
Bayer Pharma Aktiengesellschaft
US Patent
LigandPNGBDBM337752(Ethyl 1-{4-[(methoxycarbonyl)(methyl)amino]phenyl}...)
Affinity DataIC50:  630nM. Assay description: The enzyme source used is recombinant human chymase (expressed in HEK293 cells) or chymase purified from hamsters' tongues. The substrate used fo...
Ligand InfoPC cidPC sid
In DepthDetails US Patent