BDBM337767 1-[3-Chloro-4-(2-oxoimidazolidin-1-yl)phenyl]-3-[2-methyl-3-(trifluoromethyl)benzyl]-2,4-dioxo-1,2,3,4-tetrahydropyrimidine-5-carboxylic acid::US9751843, 160
SMILES Cc1c(Cn2c(=O)c(cn(-c3ccc(N4CCNC4=O)c(Cl)c3)c2=O)C(O)=O)cccc1C(F)(F)F
InChI Key InChIKey=KFAYEOAEQQRVMJ-UHFFFAOYSA-N
Data  1 IC50
  Tab Delimited (TSV)   2D SDfile   Computed 3D by Vconf -m prep SDfile
Find this compound or compounds like it in BindingDB:
Activity Spreadsheet -- Enzyme Inhibition Constant Data from BindingDB
Found 1 hit for monomerid = 337767
TargetChymase(Homo sapiens (Human))
Bayer Pharma Aktiengesellschaft
US Patent
LigandPNGBDBM337767(1-[3-Chloro-4-(2-oxoimidazolidin-1-yl)phenyl]-3-[2...)
Affinity DataIC50:  12nM. Assay description: The enzyme source used is recombinant human chymase (expressed in HEK293 cells) or chymase purified from hamsters' tongues. The substrate used fo...
Ligand InfoPC cidPC sid
In DepthDetails US Patent