BDBM33974 arylalkyne pyrazole-based compound, 5
SMILES CCCCC#Cc1cc(ccc1Cl)-c1nn(CCCN2CCOCC2)c2CCN(Cc12)S(C)(=O)=O
InChI Key InChIKey=RBCRNMCOFXRJHI-UHFFFAOYSA-N
Data  1 IC50
  Tab Delimited (TSV)   2D SDfile   Computed 3D by Vconf -m prep SDfile
Find this compound or compounds like it in BindingDB:
Activity Spreadsheet -- Enzyme Inhibition Constant Data from BindingDB
Found 1 hit for monomerid = 33974
TargetCathepsin S(Homo sapiens (Human))
Johnson & Johnson Pharmaceutical
LigandPNGBDBM33974(arylalkyne pyrazole-based compound, 5)
Affinity DataIC50:  1.10E+4nMpH: 5.0 T: 2°C. Assay description: Enzyme assays were run using fluorescence resonance energy transfer-based substrates, (Aedens)EKARVLAEAA(Dabcyl)K-amide and cathepsin S cleaves betwe...
In DepthDetails ArticlePubMed