BDBM340377 US9758538, Example 65
SMILES COC(=O)N1CC[C@@](CO)(C1)Nc1cc(nc(n1)N1CCOC[C@@H]1C)-c1cnc(N)nc1
InChI Key InChIKey=CLNPWRZFBHRGCR-RBZFPXEDSA-N
Data  1 KI
  Tab Delimited (TSV)   2D SDfile   Computed 3D by Vconf -m prep SDfile
Find this compound or compounds like it in BindingDB:
Activity Spreadsheet -- Enzyme Inhibition Constant Data from BindingDB
Found 1 hit for monomerid = 340377
TargetPhosphatidylinositol 3-kinase regulatory subunit alpha(Homo sapiens (Human))
Pfizer
US Patent
LigandPNGBDBM340377(US9758538, Example 65)
Affinity DataKi: <0.0180nM. Assay description: The biochemical assays of kinase activity of full-length PI3Kα (full-length p110α/p85α) or truncated PI3Kα (p110α/iSH2 p85&#...
Ligand InfoPC cidPC sid
In DepthDetails US Patent