BDBM34040 iodinated benzimidazole, 3a
SMILES Brc1c(I)c(I)c2[nH]cnc2c1I
InChI Key InChIKey=OBNMCCXEARSYJU-UHFFFAOYSA-N
Data  1 KI
  Tab Delimited (TSV)   2D SDfile   Computed 3D by Vconf -m prep SDfile
Find this compound or compounds like it in BindingDB:
Activity Spreadsheet -- Enzyme Inhibition Constant Data from BindingDB
Found 1 hit for monomerid = 34040
TargetCasein kinase II subunit alpha(Rattus norvegicus (Rat))
University Of Padova
LigandPNGBDBM34040(iodinated benzimidazole, 3a)
Affinity DataKi:  100nM ΔG°:  -9.93kcal/molepH: 7.5 T: 2°C. Assay description: Inhibitory effect of test compound was assessed in reaction buffer containing purified CK2, synthetic peptide substrate, and [gamma-33P]ATP. Assays w...
In DepthDetails ArticlePubMed