BDBM34175 4-[3-(2,4-dichlorophenyl)-[1,2,4]triazolo[3,4-b][1,3,4]thiadiazol-6-yl]-N,N-dimethyl-aniline::4-[3-(2,4-dichlorophenyl)-[1,2,4]triazolo[3,4-b][1,3,4]thiadiazol-6-yl]-N,N-dimethylaniline::MLS000040391::SMR000044296::[4-[3-(2,4-dichlorophenyl)-[1,2,4]triazolo[3,4-b][1,3,4]thiadiazol-6-yl]phenyl]-dimethyl-amine::cid_663607
SMILES CN(C)c1ccc(cc1)-c1nn2c(nnc2s1)-c1ccc(Cl)cc1Cl
InChI Key InChIKey=PQXLNJJWLNUZKP-UHFFFAOYSA-N
Data  3 IC50
  Tab Delimited (TSV)   2D SDfile   Computed 3D by Vconf -m prep SDfile
Find this compound or compounds like it in BindingDB:
Activity Spreadsheet -- Enzyme Inhibition Constant Data from BindingDB
Found 3 hits for monomerid = 34175
TargetBcl-2-related protein A1(Mus musculus (Mouse))
Burnham Center For Chemical Genomics
Curated by PubChem BioAssay
LigandPNGBDBM34175(4-[3-(2,4-dichlorophenyl)-[1,2,4]triazolo[3,4-b][1...)
Affinity DataIC50: >1.00E+5nMpH: 7.0 T: 2°C. Assay description: The aim is to identify chemical probes of Bfl-1 through a fluorescence polarization assay (FPA) using FITC-Bid BH3 peptide. 1) Dose-response curves c...
In DepthDetails PCBioAssay
TargetTyrosine-protein phosphatase non-receptor type 7(Homo sapiens (Human))
Burnham Center For Chemical Genomics
Curated by PubChem BioAssay
LigandPNGBDBM34175(4-[3-(2,4-dichlorophenyl)-[1,2,4]triazolo[3,4-b][1...)
Affinity DataIC50:  7.84E+4nM. Assay description: Data Source: Sanford-Burnham Center for Chemical Genomics (SBCCG) Source Affiliation: Sanford-Burnham Medical Research Institute (SBMRI, San Diego, C...
In DepthDetails PCBioAssay
TargetBcl-2-related protein A1(Mus musculus (Mouse))
Burnham Center For Chemical Genomics
Curated by PubChem BioAssay
LigandPNGBDBM34175(4-[3-(2,4-dichlorophenyl)-[1,2,4]triazolo[3,4-b][1...)
Affinity DataIC50: >1.00E+5nM. Assay description: Sanford-Burnham Center for Chemical Genomics (SBCCG) Sanford-Burnham Medical Research Institute (San Diego, CA) NIH Molecular Libraries Screening Cen...
In DepthDetails PCBioAssay