BDBM341785 (1R,2S,4s)-4-((4-fluorophenyl)sulfonyl)-4-(4-(1,1,1,3,3,3-hexafluoro-2-hydroxypropan-2-yl)phenyl)cyclopentane-1,2-diol::US9771320, Example 22
SMILES O[C@H]1C[C@](C[C@H]1O)(c1ccc(cc1)C(O)(C(F)(F)F)C(F)(F)F)S(=O)(=O)c1ccc(F)cc1
InChI Key InChIKey=MGFNANNUKWOLKH-BJWYYQGGSA-N
Data  1 IC50
  Tab Delimited (TSV)   2D SDfile   Computed 3D by Vconf -m prep SDfile
Find this compound or compounds like it in BindingDB:
Activity Spreadsheet -- Enzyme Inhibition Constant Data from BindingDB
Found 1 hit for monomerid = 341785
TargetNuclear receptor ROR-gamma(Homo sapiens (Human))
Bristol-Myers Squibb
US Patent
LigandPNGBDBM341785((1R,2S,4s)-4-((4-fluorophenyl)sulfonyl)-4-(4-(1,1,...)
Affinity DataIC50:  53nM. Assay description: The binding of potential ligands to RORγ is measured by competition with [3H] 25-hydroxycholesterol (Perkin Elmer NET674250UC) using a scintilla...
Ligand InfoPC cidPC sid
In DepthDetails US Patent