BDBM34193 1,3,8,10-tetramethyl-5-phenyl-pyrimido[1,2]pyrrolo[4,5-b]pyridazine-2,4-dione::1,3,8,10-tetramethyl-5-phenyl-pyrimido[1,2]pyrrolo[4,5-b]pyridazine-2,4-quinone::1,3,8,10-tetramethyl-5-phenylpyrimido[1,2]pyrrolo[4,5-b]pyridazine-2,4-dione::MLS000112171::SMR000108087::cid_806956
SMILES Cc1cc(C)c2c3n(C)c(=O)n(C)c(=O)c3c(-c3ccccc3)n2n1
InChI Key InChIKey=YHYJRTZOOFLMRM-UHFFFAOYSA-N
Data  2 IC50
  Tab Delimited (TSV)   2D SDfile   Computed 3D by Vconf -m prep SDfile
Find this compound or compounds like it in BindingDB:
Activity Spreadsheet -- Enzyme Inhibition Constant Data from BindingDB
Found 2 hits for monomerid = 34193
TargetBcl-2-related protein A1(Mus musculus (Mouse))
Sanford-Burnham Center For Chemical Genomics
Curated by PubChem BioAssay
LigandPNGBDBM34193(1,3,8,10-tetramethyl-5-phenyl-pyrimido[1,2]pyrrolo...)
Affinity DataIC50: >1.00E+5nM. Assay description: Sanford-Burnham Center for Chemical Genomics (SBCCG) Sanford-Burnham Medical Research Institute (San Diego, CA) NIH Molecular Libraries Screening Cen...
In DepthDetails PCBioAssay
TargetBcl-2-related protein A1(Mus musculus (Mouse))
Sanford-Burnham Center For Chemical Genomics
Curated by PubChem BioAssay
LigandPNGBDBM34193(1,3,8,10-tetramethyl-5-phenyl-pyrimido[1,2]pyrrolo...)
Affinity DataIC50: >1.00E+5nMpH: 7.0 T: 2°C. Assay description: The aim is to identify chemical probes of Bfl-1 through a fluorescence polarization assay (FPA) using FITC-Bid BH3 peptide. 1) Dose-response curves c...
In DepthDetails PCBioAssay