BDBM342138 N-(4-(3-((2-(tert-butyl)-4-(3-fluorophenyl)thiazol-5-yl)methyl)ureido)benzyl)methanesulfonamide::US9771359, EX-39
SMILES CC(C)(C)c1nc(c(CNC(=O)Nc2ccc(CNS(C)(=O)=O)cc2)s1)-c1cccc(F)c1
InChI Key InChIKey=KAAKAIXMIWSUSH-UHFFFAOYSA-N
Data  1 KI
  Tab Delimited (TSV)   2D SDfile   Computed 3D by Vconf -m prep SDfile
Find this compound or compounds like it in BindingDB:
Activity Spreadsheet -- Enzyme Inhibition Constant Data from BindingDB
Found 1 hit for monomerid = 342138
TargetTransient receptor potential cation channel subfamily V member 1(Homo sapiens (Human))
Medifron Dbt
US Patent
LigandPNGBDBM342138(N-(4-(3-((2-(tert-butyl)-4-(3-fluorophenyl)thiazol...)
Affinity DataKi:  17.6nM. Assay description: The FLIPR protocol consists of 2 substance additions during a kinetic measurement. First the compounds to be tested (5 μM) are pipetted onto the...
Ligand InfoPC cidPC sid
In DepthDetails US Patent