BDBM342250 6-(3-chlorophenyl)-4-[4-(4-methyl-5- phenyl-1H-imidazol-2-yl)-1-piperidyl]- 7H-pyrrolo[2,3-d]pyrimidine::US9771369, Compound P-3082
SMILES Cc1nc([nH]c1-c1ccccc1)C1CCN(CC1)c1ncnc2[nH]c(cc12)-c1cccc(Cl)c1
InChI Key InChIKey=SBFMFSFWSKNISY-UHFFFAOYSA-N
Data  1 KI
  Tab Delimited (TSV)   2D SDfile   Computed 3D by Vconf -m prep SDfile
Find this compound or compounds like it in BindingDB:
Activity Spreadsheet -- Enzyme Inhibition Constant Data from BindingDB
Found 1 hit for monomerid = 342250
TargetMast/stem cell growth factor receptor Kit [D816V](Homo sapiens (Human))
Plexxikon
US Patent
LigandPNGBDBM342250(6-(3-chlorophenyl)-4-[4-(4-methyl-5- phenyl-1H-imi...)
Affinity DataKi:  500nM. Assay description: The c-kit mutant D816V (or kinase domain thereof) is an active kinase in AlphaScreen. IC50 values are determined with respect to inhibition of c-Kit ...
Ligand InfoPC cidPC sid
In DepthDetails US Patent