BDBM342711 5-[4-(2,6-Dichloro-benzoyl)-piperazin-1-ylmethyl]-thiophene-2-carboxylic acid 2-trifluoromethyl-benzylamide::US9776991, Example 81
SMILES FC(F)(F)c1ccccc1CNC(=O)c1ccc(CN2CCN(CC2)C(=O)c2c(Cl)cccc2Cl)s1
InChI Key InChIKey=ZGQPAZFNDZNQQE-UHFFFAOYSA-N
Data  1 IC50
  Tab Delimited (TSV)   2D SDfile   Computed 3D by Vconf -m prep SDfile
Find this compound or compounds like it in BindingDB:
Activity Spreadsheet -- Enzyme Inhibition Constant Data from BindingDB
Found 1 hit for monomerid = 342711
TargetBifunctional epoxide hydrolase 2(Homo sapiens (Human))
Sanofi
US Patent
LigandPNGBDBM342711(5-[4-(2,6-Dichloro-benzoyl)-piperazin-1-ylmethyl]-...)
Affinity DataIC50:  2.36nM. Assay description: Compounds were tested in a biochemical screening assay using recombinant sEH purified from Sf9 insect cells and an artificial substrate, (3-phenyl-ox...
Ligand InfoPC cidPC sid
In DepthDetails US Patent