BDBM342897 1-(2-cyano-3'-fluoro-5-methoxy-4-biphenylyl)-N-2-pyrimidinyl-6-isoquinolinesulfonamide::US9776995, Example 109
SMILES COc1cc(-c2cccc(F)c2)c(cc1-c1nccc2cc(ccc12)S(=O)(=O)Nc1ncccn1)C#N
InChI Key InChIKey=KHZSWZUZGHEVHN-UHFFFAOYSA-N
Data  1 IC50
  Tab Delimited (TSV)   2D SDfile   Computed 3D by Vconf -m prep SDfile
Find this compound or compounds like it in BindingDB:
Activity Spreadsheet -- Enzyme Inhibition Constant Data from BindingDB
Found 1 hit for monomerid = 342897
TargetSodium channel protein type 9 subunit alpha(Homo sapiens (Human))
Amgen
US Patent
LigandPNGBDBM342897(1-(2-cyano-3'-fluoro-5-methoxy-4-biphenylyl)-N-2-p...)
Affinity DataIC50:  241nM. Assay description: HEK 293 cells stably transfected with human Nav1.7 were recorded in whole cell voltage clamp mode with the PatchXpress automated electrophysiology sy...
Ligand InfoPC cidPC sid
In DepthDetails US Patent