BDBM342923 1-(3',5'-difluoro-3-methoxy-4-biphenylyl)-N-(5-methyl-1,3,4-thiadiazol-2-yl)-6-isoquinolinesulfonamide::US9776995, Example 133
SMILES COc1cc(ccc1-c1nccc2cc(ccc12)S(=O)(=O)Nc1nnc(C)s1)-c1cc(F)cc(F)c1
InChI Key InChIKey=FHUOLDBDIIFVKS-UHFFFAOYSA-N
Data  1 IC50
  Tab Delimited (TSV)   2D SDfile   Computed 3D by Vconf -m prep SDfile
Find this compound or compounds like it in BindingDB:
Activity Spreadsheet -- Enzyme Inhibition Constant Data from BindingDB
Found 1 hit for monomerid = 342923
TargetSodium channel protein type 9 subunit alpha(Homo sapiens (Human))
Amgen
US Patent
LigandPNGBDBM342923(1-(3',5'-difluoro-3-methoxy-4-biphenylyl)-N-(5-met...)
Affinity DataIC50:  1.56E+3nM. Assay description: HEK 293 cells stably transfected with human Nav1.7 were recorded in whole cell voltage clamp mode with the PatchXpress automated electrophysiology sy...
Ligand InfoPC cidPC sid
In DepthDetails US Patent