BDBM343024 4-(2-chloro-4'-fluoro-5-methoxy-3'-methyl-4-biphenylyl)-N-3-isoxazolyl-7-quinazolinesulfonamide::US9776995, Example 213
SMILES COc1cc(c(Cl)cc1-c1ncnc2cc(ccc12)S(=O)(=O)Nc1ccon1)-c1ccc(F)c(C)c1
InChI Key InChIKey=UMYKNAUMBCFOQZ-UHFFFAOYSA-N
Data  1 IC50
  Tab Delimited (TSV)   2D SDfile   Computed 3D by Vconf -m prep SDfile
Find this compound or compounds like it in BindingDB:
Activity Spreadsheet -- Enzyme Inhibition Constant Data from BindingDB
Found 1 hit for monomerid = 343024
TargetSodium channel protein type 9 subunit alpha(Homo sapiens (Human))
Amgen
US Patent
LigandPNGBDBM343024(4-(2-chloro-4'-fluoro-5-methoxy-3'-methyl-4-biphen...)
Affinity DataIC50:  38.2nM. Assay description: HEK 293 cells stably transfected with human Nav1.7 were recorded in whole cell voltage clamp mode with the PatchXpress automated electrophysiology sy...
Ligand InfoPC cidPC sid
In DepthDetails US Patent