BDBM343162 4-(2-chloro-3'-fluoro-5-methoxy-4-biphenylyl)-N-3-isoxazolyl-3-methoxy-7-isoquinolinesulfonamide::US9776995, Example 401
SMILES COc1cc(c(Cl)cc1-c1c(OC)ncc2cc(ccc12)S(=O)(=O)Nc1ccon1)-c1cccc(F)c1
InChI Key InChIKey=YMPLPCWGKLTMDG-UHFFFAOYSA-N
Data  1 IC50
  Tab Delimited (TSV)   2D SDfile   Computed 3D by Vconf -m prep SDfile
Find this compound or compounds like it in BindingDB:
Activity Spreadsheet -- Enzyme Inhibition Constant Data from BindingDB
Found 1 hit for monomerid = 343162
TargetSodium channel protein type 9 subunit alpha(Homo sapiens (Human))
Amgen
US Patent
LigandPNGBDBM343162(4-(2-chloro-3'-fluoro-5-methoxy-4-biphenylyl)-N-3-...)
Affinity DataIC50:  613nM. Assay description: HEK 293 cells stably transfected with human Nav1.7 were recorded in whole cell voltage clamp mode with the PatchXpress automated electrophysiology sy...
Ligand InfoPC cidPC sid
In DepthDetails US Patent