BDBM343193 4-(3'-chloro-5-methoxy-2-methyl-4-biphenylyl)-N-2-pyrimidinyl-7-quinazolinesulfonamide::US9776995, Example 440
SMILES COc1cc(c(C)cc1-c1ncnc2cc(ccc12)S(=O)(=O)Nc1ncccn1)-c1cccc(Cl)c1
InChI Key InChIKey=LROZHRKXUCTFIX-UHFFFAOYSA-N
Data  1 IC50
  Tab Delimited (TSV)   2D SDfile   Computed 3D by Vconf -m prep SDfile
Find this compound or compounds like it in BindingDB:
Activity Spreadsheet -- Enzyme Inhibition Constant Data from BindingDB
Found 1 hit for monomerid = 343193
TargetSodium channel protein type 9 subunit alpha(Homo sapiens (Human))
Amgen
US Patent
LigandPNGBDBM343193(4-(3'-chloro-5-methoxy-2-methyl-4-biphenylyl)-N-2-...)
Affinity DataIC50:  65nM. Assay description: HEK 293 cells stably transfected with human Nav1.7 were recorded in whole cell voltage clamp mode with the PatchXpress automated electrophysiology sy...
Ligand InfoPC cidPC sid
In DepthDetails US Patent