BDBM344144 N-(5-methyl-1,2-oxazol-3-yl)-4-oxo-4,5,6,7-tetrahydrofuro[3,2-c]pyridine-3-carboxamide::US9777020, Example 38
SMILES Cc1cc(NC(=O)c2coc3CCNC(=O)c23)no1
InChI Key InChIKey=UQJLJPOXYGNSCU-UHFFFAOYSA-N
Data  1 IC50
  Tab Delimited (TSV)   2D SDfile   Computed 3D by Vconf -m prep SDfile
Find this compound or compounds like it in BindingDB:
Activity Spreadsheet -- Enzyme Inhibition Constant Data from BindingDB
Found 1 hit for monomerid = 344144
TargetHigh affinity nerve growth factor receptor(Homo sapiens (Human))
Abbvie
US Patent
LigandPNGBDBM344144(N-(5-methyl-1,2-oxazol-3-yl)-4-oxo-4,5,6,7-tetrahy...)
Affinity DataIC50:  1.72E+3nM
Ligand InfoPC cidPC sid
In DepthDetails US Patent