BDBM344210 N-[6-(4-acetylpiperazin-1-yl)-2-ethoxypyridin-3-yl]-5-(2-hydroxy-2-methylpropyl)-4-oxo-4,5,6,7-tetrahydrofuro[3,2-c]pyridine-3-carboxamide::US9777020, Example 104
SMILES CCOc1nc(ccc1NC(=O)c1coc2CCN(CC(C)(C)O)C(=O)c12)N1CCN(CC1)C(C)=O
InChI Key InChIKey=KXTDQUGWQWCUFF-UHFFFAOYSA-N
Data  1 IC50
  Tab Delimited (TSV)   2D SDfile   Computed 3D by Vconf -m prep SDfile
Find this compound or compounds like it in BindingDB:
Activity Spreadsheet -- Enzyme Inhibition Constant Data from BindingDB
Found 1 hit for monomerid = 344210
TargetHigh affinity nerve growth factor receptor(Homo sapiens (Human))
Abbvie
US Patent
LigandPNGBDBM344210(N-[6-(4-acetylpiperazin-1-yl)-2-ethoxypyridin-3-yl...)
Affinity DataIC50:  6nM
Ligand InfoPC cidPC sid
In DepthDetails US Patent