BDBM34443 4-(2,3-dihydro-1,4-benzodioxin-3-yl)-2-(2-furoylamino)thiophene-3-carboxylic acid ethyl ester::4-(2,3-dihydro-1,4-benzodioxin-3-yl)-2-[[2-furanyl(oxo)methyl]amino]-3-thiophenecarboxylic acid ethyl ester::MLS000050249::SMR000077419::cid_2958864::ethyl 4-(2,3-dihydro-1,4-benzodioxin-2-yl)-2-(2-furoylamino)-3-thiophenecarboxylate::ethyl 4-(2,3-dihydro-1,4-benzodioxin-3-yl)-2-(furan-2-carbonylamino)thiophene-3-carboxylate::ethyl 4-(2,3-dihydro-1,4-benzodioxin-3-yl)-2-(furan-2-ylcarbonylamino)thiophene-3-carboxylate
SMILES CCOC(=O)c1c(NC(=O)c2ccco2)scc1C1COc2ccccc2O1
InChI Key InChIKey=NPZFKJTWPRNAMI-UHFFFAOYSA-N
Data  6 IC50
  Tab Delimited (TSV)   2D SDfile   Computed 3D by Vconf -m prep SDfile
Find this compound or compounds like it in BindingDB:
Activity Spreadsheet -- Enzyme Inhibition Constant Data from BindingDB
Found 6 hits for monomerid = 34443
TargetGag-Pol polyprotein(Human immunodeficiency virus type 1 group M subtyp...)
University Of Pittsburgh
Curated by PubChem BioAssay
LigandPNGBDBM34443(4-(2,3-dihydro-1,4-benzodioxin-3-yl)-2-(2-furoylam...)
Affinity DataIC50:  654nMpH: 8.0 T: 2°C. Assay description: A fluorescence resonance energy transfer assay is developed in 96-well and 384-well microplate formats with robotic manipulation to enable high-throu...
In DepthDetails PCBioAssay
TargetApelin receptor(Homo sapiens (Human))
Sanford-Burnham Center For Chemical Genomics
Curated by PubChem BioAssay
LigandPNGBDBM34443(4-(2,3-dihydro-1,4-benzodioxin-3-yl)-2-(2-furoylam...)
Affinity DataIC50: >4.00E+4nM. Assay description: Data Source: Sanford-Burnham Center for Chemical Genomics (SBCCG) Source Affiliation: Sanford- Sanford-Burnham Medical Research Institute(SBMRI, San...
In DepthDetails PCBioAssay
TargetGlucose-6-phosphate dehydrogenase-6-phosphogluconolactonase(Plasmodium falciparum 3D7)
Burnham Center For Chemical Genomics
Curated by PubChem BioAssay
LigandPNGBDBM34443(4-(2,3-dihydro-1,4-benzodioxin-3-yl)-2-(2-furoylam...)
Affinity DataIC50: >8.00E+4nM. Assay description: Data Source: Sanford-Burnham Center for Chemical Genomics (SBCCG) Source Affiliation: Sanford-Burnham Medical Research Institute (SBMRI, San Diego CA...
In DepthDetails PCBioAssay
TargetGlucose-6-phosphate dehydrogenase-6-phosphogluconolactonase(Plasmodium falciparum 3D7)
Burnham Center For Chemical Genomics
Curated by PubChem BioAssay
LigandPNGBDBM34443(4-(2,3-dihydro-1,4-benzodioxin-3-yl)-2-(2-furoylam...)
Affinity DataIC50:  1.42E+4nM. Assay description: Data Source: Sanford-Burnham Center for Chemical Genomics (SBCCG) Source Affiliation: Sanford-Burnham Medical Research Institute (SBMRI, San Diego CA...
In DepthDetails PCBioAssay
TargetGlucose-6-phosphate dehydrogenase-6-phosphogluconolactonase(Plasmodium falciparum 3D7)
Burnham Center For Chemical Genomics
Curated by PubChem BioAssay
LigandPNGBDBM34443(4-(2,3-dihydro-1,4-benzodioxin-3-yl)-2-(2-furoylam...)
Affinity DataIC50: >8.00E+4nM. Assay description: Data Source: Sanford-Burnham Center for Chemical Genomics (SBCCG) Source Affiliation: Sanford-Burnham Medical Research Institute (SBMRI, San Diego CA...
In DepthDetails PCBioAssay
TargetGlucose-6-phosphate 1-dehydrogenase(Homo sapiens (Human))
Burnham Center For Chemical Genomics
Curated by PubChem BioAssay
LigandPNGBDBM34443(4-(2,3-dihydro-1,4-benzodioxin-3-yl)-2-(2-furoylam...)
Affinity DataIC50: >8.00E+4nM. Assay description: Data Source: Sanford-Burnham Center for Chemical Genomics (SBCCG) Source Affiliation: Sanford-Burnham Medical Research Institute (SBMRI, San Diego CA...
In DepthDetails PCBioAssay