BDBM344965 US9783527, Example 267::tert-butyl 3-{3-[1-(2-::tert-butyl 3-{3-[1-(2-fluorophenyl)-1H-indazol-4-yl]-2-oxoimidazolidin-1-yl}azetidine-1-carboxylate
SMILES CC(C)(C)OC(=O)N1CC(C1)N1CCN(C1=O)c1cccc2n(ncc12)-c1ccccc1F
InChI Key InChIKey=VWZGTJUVMAIWDD-UHFFFAOYSA-N
Data  1 IC50
  Tab Delimited (TSV)   2D SDfile   Computed 3D by Vconf -m prep SDfile
Find this compound or compounds like it in BindingDB:
Activity Spreadsheet -- Enzyme Inhibition Constant Data from BindingDB
Found 1 hit for monomerid = 344965
TargetSodium channel protein type 9 subunit alpha(Homo sapiens (Human))
Abbvie
US Patent
LigandPNGBDBM344965(US9783527, Example 267 | tert-butyl 3-{3-[1-(2- | ...)
Affinity DataIC50:  1.09E+3nM. Assay description: Two days prior to the experiment, frozen HEK293 cells stably expressing recombinant human Nav1.7 were quickly thawed and plated at 25,000 cells/well ...
Ligand InfoPC cidPC sid
In DepthDetails US Patent