BDBM34506 MLS000115858::N-(2-furanylmethyl)-2-[(4-oxo-3-phenyl-5,6,7,8-tetrahydro-[1]benzothiolo[2,3-d]pyrimidin-2-yl)thio]acetamide::N-(2-furfuryl)-2-[(4-keto-3-phenyl-5,6,7,8-tetrahydrobenzothiopheno[2,3-d]pyrimidin-2-yl)thio]acetamide::N-(furan-2-ylmethyl)-2-[(4-oxidanylidene-3-phenyl-5,6,7,8-tetrahydro-[1]benzothiolo[2,3-d]pyrimidin-2-yl)sulfanyl]ethanamide::N-(furan-2-ylmethyl)-2-[(4-oxo-3-phenyl-5,6,7,8-tetrahydro-[1]benzothiolo[2,3-d]pyrimidin-2-yl)sulfanyl]acetamide::SMR000092866::cid_1322134
SMILES O=C(CSc1nc2sc3CCCCc3c2c(=O)n1-c1ccccc1)NCc1ccco1
InChI Key InChIKey=ZKCBFSBMTQMVQA-UHFFFAOYSA-N
Data  1 IC50
  Tab Delimited (TSV)   2D SDfile   Computed 3D by Vconf -m prep SDfile
Find this compound or compounds like it in BindingDB:
Activity Spreadsheet -- Enzyme Inhibition Constant Data from BindingDB
Found 1 hit for monomerid = 34506
TargetGag-Pol polyprotein(Human immunodeficiency virus type 1 group M subtyp...)
University Of Pittsburgh
Curated by PubChem BioAssay
LigandPNGBDBM34506(MLS000115858 | N-(2-furanylmethyl)-2-[(4-oxo-3-phe...)
Affinity DataIC50:  1.72E+4nMpH: 8.0 T: 2°C. Assay description: A fluorescence resonance energy transfer assay is developed in 96-well and 384-well microplate formats with robotic manipulation to enable high-throu...
In DepthDetails PCBioAssay