BDBM3453 3-[6-(2,6-dichlorophenyl)-2-{[4-(diethylamino)butyl]amino}pyrido[2,3-d]pyrimidin-7-yl]-1-phenylurea::6-arylpyrido[2,3-d]pyrimidine deriv. 35
SMILES CCN(CC)CCCCNc1ncc2cc(c(NC(=O)Nc3ccccc3)nc2n1)-c1c(Cl)cccc1Cl
InChI Key InChIKey=LYJIVFCOOJRVBF-UHFFFAOYSA-N
Data  3 IC50
  Tab Delimited (TSV)   2D SDfile   Computed 3D by Vconf -m prep SDfile
Find this compound or compounds like it in BindingDB:
Activity Spreadsheet -- Enzyme Inhibition Constant Data from BindingDB
Found 3 hits for monomerid = 3453
TargetPlatelet-derived growth factor receptor beta(Homo sapiens (Human))
Pfizer
LigandPNGBDBM3453(3-[6-(2,6-dichlorophenyl)-2-{[4-(diethylamino)buty...)
Affinity DataIC50:  450nM. Assay description: IC50 is the inhibitor concentration which inhibits 50% of kinase activity that catalyzes the transfer of the terminal phosphate from [gamma-32P] labe...
In DepthDetails ArticlePubMed
TargetProto-oncogene tyrosine-protein kinase Src(Homo sapiens (Human))
Pfizer
LigandPNGBDBM3453(3-[6-(2,6-dichlorophenyl)-2-{[4-(diethylamino)buty...)
Affinity DataIC50:  7.5nM. Assay description: IC50 is the inhibitor concentration which inhibits 50% of kinase activity that catalyzes the transfer of the terminal phosphate from [gamma-32P] labe...
In DepthDetails ArticlePubMed
TargetFibroblast growth factor receptor 1(Homo sapiens (Human))
Pfizer
LigandPNGBDBM3453(3-[6-(2,6-dichlorophenyl)-2-{[4-(diethylamino)buty...)
Affinity DataIC50:  110nM. Assay description: IC50 is the inhibitor concentration which inhibits 50% of kinase activity that catalyzes the transfer of the terminal phosphate from [gamma-32P] labe...
In DepthDetails ArticlePubMed