BDBM345942 N-(2-Dimethylamino-ethyl)-N-(4-fluoro-2-trifluoromethyl-benzyl)-2-(4-isobutyl-2,3,4,5-tetrahydro-benzo[f][1,4]oxazepin-9-ylamino)-acetamide::US10202368, Example 17
SMILES CC(C)CN1CCOc2c(C1)cccc2NCC(=O)N(CCN(C)C)Cc1ccc(F)cc1C(F)(F)F
InChI Key InChIKey=SYBYBRBHMRPQIW-UHFFFAOYSA-N
Data  1 EC50
  Tab Delimited (TSV)   2D SDfile   Computed 3D by Vconf -m prep SDfile
Find this compound or compounds like it in BindingDB:
Activity Spreadsheet -- Enzyme Inhibition Constant Data from BindingDB
Found 1 hit for monomerid = 345942
TargetAtypical chemokine receptor 3(Homo sapiens (Human))
Idorsia Pharmaceuticals
US Patent
LigandPNGBDBM345942(N-(2-Dimethylamino-ethyl)-N-(4-fluoro-2-trifluorom...)
Affinity DataEC50:  59nM. Assay description: The assay is using the PathHunter CHO-K1 CXCR7 β-arrestin cell line from DiscoverX. The system is based on the Enzyme Fragment Complementation T...
Ligand InfoPC cidPC sid
In DepthDetails US Patent