BDBM345949 N-(2-Dimethylamino-ethyl)-2-[3-(2-methoxy-acetyl)-2,3,4,5-tetrahydro-1H-benzo[d]azepin-6-yloxy]-N-(2-trifluoromethyl-benzyl)-acetamide::US10202368, Example 24
SMILES COCC(=O)N1CCc2cccc(OCC(=O)N(CCN(C)C)Cc3ccccc3C(F)(F)F)c2CC1
InChI Key InChIKey=ZPHLXZRAJGMDDB-UHFFFAOYSA-N
Data  1 EC50
  Tab Delimited (TSV)   2D SDfile   Computed 3D by Vconf -m prep SDfile
Find this compound or compounds like it in BindingDB:
Activity Spreadsheet -- Enzyme Inhibition Constant Data from BindingDB
Found 1 hit for monomerid = 345949
TargetAtypical chemokine receptor 3(Homo sapiens (Human))
Idorsia Pharmaceuticals
US Patent
LigandPNGBDBM345949(N-(2-Dimethylamino-ethyl)-2-[3-(2-methoxy-acetyl)-...)
Affinity DataEC50:  3nM. Assay description: The assay is using the PathHunter CHO-K1 CXCR7 β-arrestin cell line from DiscoverX. The system is based on the Enzyme Fragment Complementation T...
Ligand InfoPC cidPC sid
In DepthDetails US Patent