BDBM345979 2-(4-Ethyl-5-oxo-2,3,4,5-tetrahydro-benzo[f][1,4]oxazepin-9-ylamino)-N-(2-isopropylamino-ethyl)-N-(2-trifluoromethyl-benzyl)-acetamide::US10202368, Example 56
SMILES CCN1CCOc2c(NCC(=O)N(CCNC(C)C)Cc3ccccc3C(F)(F)F)cccc2C1=O
InChI Key InChIKey=GHXOXYIKSYPBPC-UHFFFAOYSA-N
Data  1 EC50
  Tab Delimited (TSV)   2D SDfile   Computed 3D by Vconf -m prep SDfile
Find this compound or compounds like it in BindingDB:
Activity Spreadsheet -- Enzyme Inhibition Constant Data from BindingDB
Found 1 hit for monomerid = 345979
TargetAtypical chemokine receptor 3(Homo sapiens (Human))
Idorsia Pharmaceuticals
US Patent
LigandPNGBDBM345979(2-(4-Ethyl-5-oxo-2,3,4,5-tetrahydro-benzo[f][1,4]o...)
Affinity DataEC50:  16nM. Assay description: The assay is using the PathHunter CHO-K1 CXCR7 β-arrestin cell line from DiscoverX. The system is based on the Enzyme Fragment Complementation T...
Ligand InfoPC cidPC sid
In DepthDetails US Patent