BDBM34614 1-(4-bromophenyl)-3-[4-(2-fluorophenyl)-1-piperazinyl]-1-propanone;hydrochloride::1-(4-bromophenyl)-3-[4-(2-fluorophenyl)piperazin-1-yl]propan-1-one;hydrochloride::1-(4-bromophenyl)-3-[4-(2-fluorophenyl)piperazino]propan-1-one;hydrochloride::MLS000047943::SMR000033943::cid_6602834
SMILES Fc1ccccc1N1CCN(CCC(=O)c2ccc(Br)cc2)CC1
InChI Key InChIKey=COYPQWFXZVIOEG-UHFFFAOYSA-N
Data  1 IC50
  Tab Delimited (TSV)   2D SDfile   Computed 3D by Vconf -m prep SDfile
Find this compound or compounds like it in BindingDB:
Activity Spreadsheet -- Enzyme Inhibition Constant Data from BindingDB
Found 1 hit for monomerid = 34614
TargetMannose-6-phosphate isomerase(Homo sapiens (Human))
Burnham Center For Chemical Genomics
Curated by PubChem BioAssay
LigandPNGBDBM34614(1-(4-bromophenyl)-3-[4-(2-fluorophenyl)-1-piperazi...)
Affinity DataIC50:  3.82E+4nMpH: 7.4 T: 2°C. Assay description: The purpose of this assay is to identify non-competititve inhibitors of human PMI. This is accomplished by using a G6PD- NADPH-coupled assay. In the ...
In DepthDetails PCBioAssay