BDBM347075 US10202399, Example 1
SMILES Oc1n[nH]c(CCc2ccccc2)cc1=O
InChI Key InChIKey=LQVOQKJUHJKVFE-UHFFFAOYSA-N
Data  1 IC50
PDB links: 1 PDB ID matches this monomer.
  Tab Delimited (TSV)   2D SDfile   Computed 3D by Vconf -m prep SDfile
Find this compound or compounds like it in BindingDB:
Activity Spreadsheet -- Enzyme Inhibition Constant Data from BindingDB
Found 1 hit for monomerid = 347075
TargetD-amino-acid oxidase(Homo sapiens (Human))
Takeda Pharmaceutical
US Patent
LigandPNGBDBM347075(US10202399, Example 1)
Affinity DataIC50:  3.80nM. Assay description: The DAAO inhibitory activity was measured by assaying the amount of hydrogen peroxide (H2O2) produced by reacting DAAO protein with flavin adenine di...
Ligand InfoPC cidPC sidPDB