BDBM347230 US10202404, Compound C-2
SMILES CCN1CN(CCOC)C(=O)c2c(O)c(=O)c(cn12)-c1nnc(Cc2ccc(F)cc2F)s1
InChI Key InChIKey=SAQRTGRRKZKQAY-UHFFFAOYSA-N
Data  1 EC50
  Tab Delimited (TSV)   2D SDfile   Computed 3D by Vconf -m prep SDfile
Find this compound or compounds like it in BindingDB:
Activity Spreadsheet -- Enzyme Inhibition Constant Data from BindingDB
Found 1 hit for monomerid = 347230
TargetGag-Pol polyprotein(Human immunodeficiency virus type 1 group M subtyp...)
Shionogi
US Patent
LigandPNGBDBM347230(US10202404, Compound C-2)
Affinity DataEC50:  1.40nM. Assay description: Previously, a series of two-fold dilution on test samples were carried out in a 96-well plate (50 μL/well). Two plates were made for measuring a...
Ligand InfoPC cidPC sid
In DepthDetails US Patent