BDBM348095 US9790228, Compound 14
SMILES COc1ccccc1-c1nc2ccccc2cc1Cn1nc(-c2cccc(O)c2)c2c(N)ncnc12
InChI Key InChIKey=WJCCRHFANMVGHA-UHFFFAOYSA-N
Data  1 IC50
  Tab Delimited (TSV)   2D SDfile   Computed 3D by Vconf -m prep SDfile
Find this compound or compounds like it in BindingDB:
Activity Spreadsheet -- Enzyme Inhibition Constant Data from BindingDB
Found 1 hit for monomerid = 348095
LigandPNGBDBM348095(US9790228, Compound 14)
Affinity DataIC50:  550nM. Assay description: Class I PI3-Ks can be either purchased (p110α/p85α, p110β/p85α, p110δ/p85α from Upstate, and p110γ from Sigma) or ...
Ligand InfoPC cidPC sid
In DepthDetails US Patent