BDBM348156 US9790228, Compound 75
SMILES Nc1ncnc2n(Cc3cc4ccccc4nc3NCCN3CCOCC3)nc(-c3cc(O)cc(F)c3)c12
InChI Key InChIKey=WBWJPPDJPUMCIB-UHFFFAOYSA-N
Data  4 IC50
  Tab Delimited (TSV)   2D SDfile   Computed 3D by Vconf -m prep SDfile
Find this compound or compounds like it in BindingDB:
Activity Spreadsheet -- Enzyme Inhibition Constant Data from BindingDB
Found 4 hits for monomerid = 348156
LigandPNGBDBM348156(US9790228, Compound 75)
Affinity DataIC50: <100nM. Assay description: Class I PI3-Ks can be either purchased (p110α/p85α, p110β/p85α, p110δ/p85α from Upstate, and p110γ from Sigma) or ...
Ligand InfoPC cidPC sid
In DepthDetails US Patent
LigandPNGBDBM348156(US9790228, Compound 75)
Affinity DataIC50: >1.00E+3nM. Assay description: Class I PI3-Ks can be either purchased (p110α/p85α, p110β/p85α, p110δ/p85α from Upstate, and p110γ from Sigma) or ...
Ligand InfoPC cidPC sid
In DepthDetails US Patent
TargetPhosphatidylinositol 3-kinase regulatory subunit alpha(Homo sapiens (Human))
Intellikine
US Patent
LigandPNGBDBM348156(US9790228, Compound 75)
Affinity DataIC50: >1.00E+3nM. Assay description: Class I PI3-Ks can be either purchased (p110α/p85α, p110β/p85α, p110δ/p85α from Upstate, and p110γ from Sigma) or ...
Ligand InfoPC cidPC sid
In DepthDetails US Patent
LigandPNGBDBM348156(US9790228, Compound 75)
Affinity DataIC50: >1.00E+3nM. Assay description: Class I PI3-Ks can be either purchased (p110α/p85α, p110β/p85α, p110δ/p85α from Upstate, and p110γ from Sigma) or ...
Ligand InfoPC cidPC sid
In DepthDetails US Patent