BDBM348969 N-(5-(4-(4-(4- chlorophenyl)piperidine-1- carbonyl(phenyl)- [1,2,4]triazolo[1,5-a]pyridin-2- yl)cyclopropanecarboxamide::US10206907, Compound 86
SMILES Clc1ccc(cc1)C1CCN(CC1)C(=O)c1ccc(cc1)-c1cccc2nc(NC(=O)C3CC3)nn12
InChI Key InChIKey=JSIISODASOYUQK-UHFFFAOYSA-N
Data  1 IC50
  Tab Delimited (TSV)   2D SDfile   Computed 3D by Vconf -m prep SDfile
Find this compound or compounds like it in BindingDB:
Activity Spreadsheet -- Enzyme Inhibition Constant Data from BindingDB
Found 1 hit for monomerid = 348969
TargetTyrosine-protein kinase JAK1 [850-1154](Homo sapiens (Human))
Galapagos
US Patent
LigandPNGBDBM348969(N-(5-(4-(4-(4- chlorophenyl)piperidine-1- carbonyl...)
Affinity DataIC50: <100nM. Assay description: Recombinant human JAK1 catalytic domain (amino acids 850-1154; catalog number 08-144) was purchased from Carna Biosciences. 10 ng of JAK1 was incubat...
Ligand InfoPC cidPC sid
In DepthDetails US Patent