BDBM348983 N-(5-(4-(4- morpholinopiperidine-1- carbonyl)phenyl)- [1,2,4]triazolo[1,5-a]pyridin-2- yl)cyclopropanecarboxamide::US10206907, Compound 101
SMILES O=C(Nc1nc2cccc(-c3ccc(cc3)C(=O)N3CCC(CC3)N3CCOCC3)n2n1)C1CC1
InChI Key InChIKey=RVLMMAXRNLRBHN-UHFFFAOYSA-N
Data  1 IC50
  Tab Delimited (TSV)   2D SDfile   Computed 3D by Vconf -m prep SDfile
Find this compound or compounds like it in BindingDB:
Activity Spreadsheet -- Enzyme Inhibition Constant Data from BindingDB
Found 1 hit for monomerid = 348983
TargetTyrosine-protein kinase JAK1 [850-1154](Homo sapiens (Human))
Galapagos
US Patent
LigandPNGBDBM348983(N-(5-(4-(4- morpholinopiperidine-1- carbonyl)pheny...)
Affinity DataIC50:  550nM. Assay description: Recombinant human JAK1 catalytic domain (amino acids 850-1154; catalog number 08-144) was purchased from Carna Biosciences. 10 ng of JAK1 was incubat...
Ligand InfoPC cidPC sid
In DepthDetails US Patent