BDBM34985 benzothienopyrimidinone deriv., 6b
SMILES Clc1ccc2sc3c(nc(CN4CCCCC4)[nH]c3=O)c2c1
InChI Key InChIKey=DJOXKKRRSXGVNT-UHFFFAOYSA-N
Data  2 KI
  Tab Delimited (TSV)   2D SDfile   Computed 3D by Vconf -m prep SDfile
Find this compound or compounds like it in BindingDB:
Activity Spreadsheet -- Enzyme Inhibition Constant Data from BindingDB
Found 2 hits for monomerid = 34985
TargetSerine/threonine-protein kinase pim-1(Homo sapiens (Human))
Abbott Laboratories
LigandPNGBDBM34985(benzothienopyrimidinone deriv., 6b)
Affinity DataKi:  12nM ΔG°:  -10.7kcal/molepH: 7.5 T: 2°C. Assay description: In 384-well v-bottom polypropylene plates, compound (2% DMSO) was mixed with Pim kinase and peptide substrate, followed by immediate initiation with ...
In DepthDetails ArticlePubMed
TargetSerine/threonine-protein kinase pim-2(Homo sapiens (Human))
Abbott Laboratories
LigandPNGBDBM34985(benzothienopyrimidinone deriv., 6b)
Affinity DataKi:  149nM ΔG°:  -9.31kcal/moleT: 2°C. Assay description: In 384-well v-bottom polypropylene plates, compound (2% DMSO) was mixed with Pim kinase and peptide substrate, followed by immediate initiation with ...
In DepthDetails ArticlePubMed