BDBM349988 4-((S)-2-((E)-3-(3-Chloro-2-fluoro-6-(1H-tetrazol-1-yl)phenyl)acryloyl)-5-((S)-3-(dimethylamino)pyrrolidin-1-yl)-1,2,3,4-tetrahydroisoquinoline-1-carboxamido)benzoic acid, bis-TFA Salt::US10208021, Example 206
SMILES CN(C)[C@H]1CCN(C1)c1cccc2[C@H](N(CCc12)C(=O)\C=C\c1c(F)c(Cl)ccc1-n1cnnn1)C(=O)Nc1ccc(cc1)C(O)=O
InChI Key InChIKey=VWQSNPCZPJHKDH-MCUBOHNHSA-N
Data  1 KI
  Tab Delimited (TSV)   2D SDfile   Computed 3D by Vconf -m prep SDfile
Find this compound or compounds like it in BindingDB:
Activity Spreadsheet -- Enzyme Inhibition Constant Data from BindingDB
Found 1 hit for monomerid = 349988
TargetCoagulation factor XI(Homo sapiens (Human))
Bristol-Myers Squibb
US Patent
LigandPNGBDBM349988(4-((S)-2-((E)-3-(3-Chloro-2-fluoro-6-(1H-tetrazol-...)
Affinity DataKi: <5nM. Assay description: Factor XIa determinations were made in 50 mM HEPES buffer at pH 7.4 containing 145 mM NaCl, 5 mM KCl, and 0.1% PEG 8000 (polyethylene glycol; JT Bake...
Ligand InfoPC cidPC sid
In DepthDetails US Patent