BDBM350040 US10208024, Example 39::US10766881, Example 39
SMILES COCCN1CCC(CC1)n1cc(cn1)-c1cnc(N)c(n1)-c1ccc(=O)n(n1)-c1cc(OC)ccc1C
InChI Key InChIKey=JXPRBHWXUDJBNA-UHFFFAOYSA-N
Data  6 IC50
  Tab Delimited (TSV)   2D SDfile   Computed 3D by Vconf -m prep SDfile
Find this compound or compounds like it in BindingDB:
Activity Spreadsheet -- Enzyme Inhibition Constant Data from BindingDB
Found 6 hits for monomerid = 350040
TargetFibroblast growth factor receptor 1(Homo sapiens (Human))
Array Biopharma
US Patent
LigandPNGBDBM350040(US10208024, Example 39 | US10766881, Example 39)
Affinity DataIC50:  142nM. Assay description: FGFR1, 2 and 3 kinase activity was measured by the Invitrogen LanthaScreen™ Assay technology which directly measures the amount of substrate phosphor...
Ligand InfoPC cidPC sid
In DepthDetails US Patent
TargetFibroblast growth factor receptor 2(Homo sapiens (Human))
Array Biopharma
US Patent
LigandPNGBDBM350040(US10208024, Example 39 | US10766881, Example 39)
Affinity DataIC50:  9.40nM. Assay description: FGFR1, 2 and 3 kinase activity was measured by the Invitrogen LanthaScreen™ Assay technology which directly measures the amount of substrate phosphor...
Ligand InfoPC cidPC sid
In DepthDetails US Patent
TargetFibroblast growth factor receptor 3 [397-806](Homo sapiens (Human))
Array Biopharma
US Patent
LigandPNGBDBM350040(US10208024, Example 39 | US10766881, Example 39)
Affinity DataIC50:  28.6nM
Ligand InfoPC cidPC sid
In DepthDetails US Patent
TargetFibroblast growth factor receptor 1 [308-731](Homo sapiens (Human))
Array Biopharma
US Patent
LigandPNGBDBM350040(US10208024, Example 39 | US10766881, Example 39)
Affinity DataIC50:  142nM. Assay description: To measure FGFR1 kinase activity, 200 pM His-tagged recombinant human FGFR1 catalytic domain (amino acids 308-731) (Life Technologies Cat. No. PR4660...
Ligand InfoPC cidPC sid
In DepthDetails US Patent
TargetFibroblast growth factor receptor 2 [403-822](Homo sapiens (Human))
Array Biopharma
US Patent
LigandPNGBDBM350040(US10208024, Example 39 | US10766881, Example 39)
Affinity DataIC50:  9.40nM
Ligand InfoPC cidPC sid
In DepthDetails US Patent
TargetFibroblast growth factor receptor 3(Homo sapiens (Human))
Array Biopharma
US Patent
LigandPNGBDBM350040(US10208024, Example 39 | US10766881, Example 39)
Affinity DataIC50:  28.6nM. Assay description: FGFR1, 2 and 3 kinase activity was measured by the Invitrogen LanthaScreen™ Assay technology which directly measures the amount of substrate phosphor...
Ligand InfoPC cidPC sid
In DepthDetails US Patent