BDBM350073 6-(3-amino-6-(1-(1- hydroxy-2- methylpropan-2-yl)-1H- pyrazol-4-yl)pyrazin-2- yl)-2-(2,6-dichloro-3,5- dimethoxyphenyl)pyridazin- 3(2H)-one::US10208024, Example 72::US10766881, Example 72
SMILES COc1cc(OC)c(Cl)c(c1Cl)-n1nc(ccc1=O)-c1nc(cnc1N)-c1cnn(c1)C(C)(C)CO
InChI Key InChIKey=KSYWMSVHBYZLJH-UHFFFAOYSA-N
Data  6 IC50
  Tab Delimited (TSV)   2D SDfile   Computed 3D by Vconf -m prep SDfile
Find this compound or compounds like it in BindingDB:
Activity Spreadsheet -- Enzyme Inhibition Constant Data from BindingDB
Found 6 hits for monomerid = 350073
TargetFibroblast growth factor receptor 1(Homo sapiens (Human))
Array Biopharma
US Patent
LigandPNGBDBM350073(6-(3-amino-6-(1-(1- hydroxy-2- methylpropan-2-yl)-...)
Affinity DataIC50:  7.30nM. Assay description: FGFR1, 2 and 3 kinase activity was measured by the Invitrogen LanthaScreen™ Assay technology which directly measures the amount of substrate phosphor...
Ligand InfoPC cidPC sid
In DepthDetails US Patent
TargetFibroblast growth factor receptor 2(Homo sapiens (Human))
Array Biopharma
US Patent
LigandPNGBDBM350073(6-(3-amino-6-(1-(1- hydroxy-2- methylpropan-2-yl)-...)
Affinity DataIC50:  9.30nM. Assay description: FGFR1, 2 and 3 kinase activity was measured by the Invitrogen LanthaScreen™ Assay technology which directly measures the amount of substrate phosphor...
Ligand InfoPC cidPC sid
In DepthDetails US Patent
TargetFibroblast growth factor receptor 3 [397-806](Homo sapiens (Human))
Array Biopharma
US Patent
LigandPNGBDBM350073(6-(3-amino-6-(1-(1- hydroxy-2- methylpropan-2-yl)-...)
Affinity DataIC50:  5.20nM
Ligand InfoPC cidPC sid
In DepthDetails US Patent
TargetFibroblast growth factor receptor 1 [308-731](Homo sapiens (Human))
Array Biopharma
US Patent
LigandPNGBDBM350073(6-(3-amino-6-(1-(1- hydroxy-2- methylpropan-2-yl)-...)
Affinity DataIC50:  7.30nM. Assay description: To measure FGFR1 kinase activity, 200 pM His-tagged recombinant human FGFR1 catalytic domain (amino acids 308-731) (Life Technologies Cat. No. PR4660...
Ligand InfoPC cidPC sid
In DepthDetails US Patent
TargetFibroblast growth factor receptor 2 [403-822](Homo sapiens (Human))
Array Biopharma
US Patent
LigandPNGBDBM350073(6-(3-amino-6-(1-(1- hydroxy-2- methylpropan-2-yl)-...)
Affinity DataIC50:  9.30nM
Ligand InfoPC cidPC sid
In DepthDetails US Patent
TargetFibroblast growth factor receptor 3(Homo sapiens (Human))
Array Biopharma
US Patent
LigandPNGBDBM350073(6-(3-amino-6-(1-(1- hydroxy-2- methylpropan-2-yl)-...)
Affinity DataIC50:  5.20nM. Assay description: FGFR1, 2 and 3 kinase activity was measured by the Invitrogen LanthaScreen™ Assay technology which directly measures the amount of substrate phosphor...
Ligand InfoPC cidPC sid
In DepthDetails US Patent