BDBM350191 US10208056, Compound 23
SMILES Cn1c(cc2c1-c1ccncc1OC2(C)C)C(O)=O
InChI Key InChIKey=VLALJCBKWZZVIP-UHFFFAOYSA-N
Data  3 IC50
  Tab Delimited (TSV)   2D SDfile   Computed 3D by Vconf -m prep SDfile
Find this compound or compounds like it in BindingDB:
Activity Spreadsheet -- Enzyme Inhibition Constant Data from BindingDB
Found 3 hits for monomerid = 350191
TargetCyclin-C/Cyclin-dependent kinase 8(Homo sapiens (Human))
F.S.P. Cnio
US Patent
LigandPNGBDBM350191(US10208056, Compound 23)
Affinity DataIC50:  61.1nM. Assay description: The binding assay relies on the LanthaScreen™ Eu-Kinase Binding Assay (Invitrogen. This is a kinase assay platform based on measuring the binding and...
Ligand InfoPC cidPC sid
In DepthDetails US Patent
TargetCyclin-C/Cyclin-dependent kinase 19(Homo sapiens (Human))
F.S.P. Cnio
US Patent
LigandPNGBDBM350191(US10208056, Compound 23)
Affinity DataIC50:  233nM. Assay description: The binding assay relies on the LanthaScreen™ Eu-Kinase Binding Assay (Invitrogen). This is a kinase assay platform based on measuring the binding an...
Ligand InfoPC cidPC sid
In DepthDetails US Patent
TargetSerine/threonine-protein kinase haspin(Homo sapiens (Human))
F.S.P. Cnio
US Patent
LigandPNGBDBM350191(US10208056, Compound 23)
Affinity DataIC50:  648nM. Assay description: The kinase assay relies on ADP-GloKM biochemical kinase assay (Promega). This is a luminescent kinase assay that measures ADP formed from a kinase re...
Ligand InfoPC cidPC sid
In DepthDetails US Patent