BDBM35088 biarylether alcohol quinoline, 5a
SMILES OCc1cccc(Oc2cccc(c2)-c2c(Cc3ccccc3)cnc3c(cccc23)C(F)(F)F)c1
InChI Key InChIKey=JZHGBILVGRSOHN-UHFFFAOYSA-N
Data  2 IC50  1 EC50
  Tab Delimited (TSV)   2D SDfile   Computed 3D by Vconf -m prep SDfile
Find this compound or compounds like it in BindingDB:
Activity Spreadsheet -- Enzyme Inhibition Constant Data from BindingDB
Found 2 hits for monomerid = 35088
TargetOxysterols receptor LXR-beta [154-461](Homo sapiens (Human))
Wyeth Research
LigandPNGBDBM35088(biarylether alcohol quinoline, 5a)
Affinity DataIC50:  11.7nM EC50:  1.03E+3nMpH: 7.4 T: 2°C. Assay description: Binding reaction was initiated by adding a dilution series of test compound in tracer solution to LXRbeta coated flash plates. Each concentration of ...
In DepthDetails ArticlePubMed
TargetOxysterols receptor LXR-alpha [197-447](Homo sapiens (Human))
Wyeth Research
LigandPNGBDBM35088(biarylether alcohol quinoline, 5a)
Affinity DataIC50:  75nM. Assay description: Binding reaction was initiated by adding a dilution series of test compound in tracer solution to LXRalpha coated flash plates. Each concentration of...
In DepthDetails ArticlePubMed