BDBM351322 N-(3,4-dichlorophenyl)-7-{[2-(8-methyl-8- azabicyclo[3.2.1]oct-3-yl)ethyl]oxy}-6- (methyloxy)quinazolin-4-amine::US9796704, Entry 57
SMILES COc1cc2c(Nc3ccc(Cl)c(Cl)c3)ncnc2cc1OCCC1CC2CCC(C1)N2C
InChI Key InChIKey=KLDWSPPOKXJTIT-UHFFFAOYSA-N
Data  10 IC50
  Tab Delimited (TSV)   2D SDfile   Computed 3D by Vconf -m prep SDfile
Find this compound or compounds like it in BindingDB:
Activity Spreadsheet -- Enzyme Inhibition Constant Data from BindingDB
Found 10 hits for monomerid = 351322
TargetEphrin type-B receptor 4(Homo sapiens (Human))
Symphony Evolution
US Patent
LigandPNGBDBM351322(N-(3,4-dichlorophenyl)-7-{[2-(8-methyl-8- azabicyc...)
Affinity DataIC50:  525nM. Assay description: In AlphaScreen, when the donor and acceptor beads are close in proximity, a series of photochemical events will give rise to a fluorescent signal upo...
Ligand InfoPC cidPC sid
In DepthDetails US Patent
TargetEphrin type-A receptor 2(Homo sapiens (Human))
Symphony Evolution
US Patent
LigandPNGBDBM351322(N-(3,4-dichlorophenyl)-7-{[2-(8-methyl-8- azabicyc...)
Affinity DataIC50:  1.05E+4nM. Assay description: In AlphaScreen, when the donor and acceptor beads are close in proximity, a series of photochemical events will give rise to a fluorescent signal upo...
Ligand InfoPC cidPC sid
In DepthDetails US Patent
TargetVascular endothelial growth factor receptor 2(Homo sapiens (Human))
Symphony Evolution
US Patent
LigandPNGBDBM351322(N-(3,4-dichlorophenyl)-7-{[2-(8-methyl-8- azabicyc...)
Affinity DataIC50:  1.05E+4nM. Assay description: In AlphaScreen, when the donor and acceptor beads are close in proximity, a series of photochemical events will give rise to a fluorescent signal upo...
Ligand InfoPC cidPC sid
In DepthDetails US Patent
TargetVascular endothelial growth factor receptor 1(Homo sapiens (Human))
Symphony Evolution
US Patent
LigandPNGBDBM351322(N-(3,4-dichlorophenyl)-7-{[2-(8-methyl-8- azabicyc...)
Affinity DataIC50:  1.05E+4nM. Assay description: In AlphaScreen, when the donor and acceptor beads are close in proximity, a series of photochemical events will give rise to a fluorescent signal upo...
Ligand InfoPC cidPC sid
In DepthDetails US Patent
TargetEpidermal growth factor receptor(Homo sapiens (Human))
Symphony Evolution
US Patent
LigandPNGBDBM351322(N-(3,4-dichlorophenyl)-7-{[2-(8-methyl-8- azabicyc...)
Affinity DataIC50: <50nM. Assay description: In AlphaScreen, when the donor and acceptor beads are close in proximity, a series of photochemical events will give rise to a fluorescent signal upo...
Ligand InfoPC cidPC sid
In DepthDetails US Patent
TargetReceptor tyrosine-protein kinase erbB-2(Homo sapiens (Human))
Symphony Evolution
US Patent
LigandPNGBDBM351322(N-(3,4-dichlorophenyl)-7-{[2-(8-methyl-8- azabicyc...)
Affinity DataIC50:  525nM. Assay description: In AlphaScreen, when the donor and acceptor beads are close in proximity, a series of photochemical events will give rise to a fluorescent signal upo...
Ligand InfoPC cidPC sid
In DepthDetails US Patent
TargetEphrin type-B receptor 4(Homo sapiens (Human))
Symphony Evolution
US Patent
LigandPNGBDBM351322(N-(3,4-dichlorophenyl)-7-{[2-(8-methyl-8- azabicyc...)
Affinity DataIC50:  525nM. Assay description: In AlphaScreen, when the donor and acceptor beads are close in proximity, a series of photochemical events will give rise to a fluorescent signal upo...
Ligand InfoPC cidPC sid
In DepthDetails US Patent
TargetEphrin type-A receptor 2(Homo sapiens (Human))
Symphony Evolution
US Patent
LigandPNGBDBM351322(N-(3,4-dichlorophenyl)-7-{[2-(8-methyl-8- azabicyc...)
Affinity DataIC50:  525nM. Assay description: In AlphaScreen, when the donor and acceptor beads are close in proximity, a series of photochemical events will give rise to a fluorescent signal upo...
Ligand InfoPC cidPC sid
In DepthDetails US Patent
TargetVascular endothelial growth factor receptor 2(Homo sapiens (Human))
Symphony Evolution
US Patent
LigandPNGBDBM351322(N-(3,4-dichlorophenyl)-7-{[2-(8-methyl-8- azabicyc...)
Affinity DataIC50:  525nM. Assay description: In AlphaScreen, when the donor and acceptor beads are close in proximity, a series of photochemical events will give rise to a fluorescent signal upo...
Ligand InfoPC cidPC sid
In DepthDetails US Patent
TargetEpidermal growth factor receptor(Homo sapiens (Human))
Symphony Evolution
US Patent
LigandPNGBDBM351322(N-(3,4-dichlorophenyl)-7-{[2-(8-methyl-8- azabicyc...)
Affinity DataIC50: <50nM. Assay description: In AlphaScreen, when the donor and acceptor beads are close in proximity, a series of photochemical events will give rise to a fluorescent signal upo...
Ligand InfoPC cidPC sid
In DepthDetails US Patent