BDBM351821 US9796716, Compound 66
SMILES Nc1ncnc2n(nc(-c3ccc(Oc4cc(F)cc(CCc5ccccc5)c4)cc3)c12)C1CCOCC1
InChI Key InChIKey=FSXPKKNAKNWCMB-UHFFFAOYSA-N
Data  1 KI
  Tab Delimited (TSV)   2D SDfile   Computed 3D by Vconf -m prep SDfile
Find this compound or compounds like it in BindingDB:
Activity Spreadsheet -- Enzyme Inhibition Constant Data from BindingDB
Found 1 hit for monomerid = 351821
TargetTyrosine-protein kinase BTK(Homo sapiens (Human))
Pharmascience
US Patent
LigandPNGBDBM351821(US9796716, Compound 66)
Affinity DataKi: <100nM. Assay description: Fluorescence polarization-based kinase assays were performed in 384 well-plate format using histidine tagged recombinant human full-length Bruton Aga...
Ligand InfoPC cidPC sid
In DepthDetails US Patent