BDBM35189 indazole-benzimidazole, 25
SMILES CN1CCN(CC1)c1cccc2[nH]c(nc12)-c1n[nH]c2cc(ccc12)-c1ccc2ccoc2c1
InChI Key InChIKey=SXONINFUOAVKTR-UHFFFAOYSA-N
Data  1 IC50
  Tab Delimited (TSV)   2D SDfile   Computed 3D by Vconf -m prep SDfile
Find this compound or compounds like it in BindingDB:
Activity Spreadsheet -- Enzyme Inhibition Constant Data from BindingDB
Found 1 hit for monomerid = 35189
TargetProtein kinase C zeta type(Homo sapiens (Human))
Pfizer
LigandPNGBDBM35189(indazole-benzimidazole, 25)
Affinity DataIC50:  3.02E+3nMpH: 7.5 T: 2°C. Assay description: Protein kinase C (PKC), zeta activity was measured by following the phosphorylation of a biotinylated peptide substrate in the presence of ATP using ...
In DepthDetails ArticlePubMed