BDBM354443 N-(6-(1,4'- bipiperidin-1'-yl)-2- ethylimidazo[1,2- b]pyridazin-3-yl)-4- (4-fluorophenyl)-N- methylthiazol-2- amine::US9796719, Compound 111
SMILES CCc1nc2ccc(nn2c1N(C)c1nc(cs1)-c1ccc(F)cc1)N1CCC(CC1)N1CCCCC1
InChI Key InChIKey=VGLPUNLVBXXQFV-UHFFFAOYSA-N
Data  1 IC50
  Tab Delimited (TSV)   2D SDfile   Computed 3D by Vconf -m prep SDfile
Find this compound or compounds like it in BindingDB:
Activity Spreadsheet -- Enzyme Inhibition Constant Data from BindingDB
Found 1 hit for monomerid = 354443
TargetEctonucleotide pyrophosphatase/phosphodiesterase family member 2(Homo sapiens (Human))
Galapagos
US Patent
LigandPNGBDBM354443(N-(6-(1,4'- bipiperidin-1'-yl)-2- ethylimidazo[1,2...)
Affinity DataIC50: >1.00E+4nM. Assay description: Compound IC50 values are determined in a fluorescent hENPP2 (UniProtKB/SwissProt Sequence ref Q13822) biochemical assay using the fluorogenic autotax...
Ligand InfoPC cidPC sid
In DepthDetails US Patent