BDBM354486 US9796719, Compound 154::[1-(2-Ethyl-3-{[4- (4-fluoro-phenyl)- thiazol-2-yl]- methyl-amino}- imidazo[1,2- b]pyridazin-6-yl)- azetidin-3-yl]- carbamic acid tert- butyl ester
SMILES CCc1nc2ccc(nn2c1N(C)c1nc(cs1)-c1ccc(F)cc1)N1CC(C1)NC(=O)OC(C)(C)C
InChI Key InChIKey=XNBXLEBCMRTZFB-UHFFFAOYSA-N
Data  2 IC50
  Tab Delimited (TSV)   2D SDfile   Computed 3D by Vconf -m prep SDfile
Find this compound or compounds like it in BindingDB:
Activity Spreadsheet -- Enzyme Inhibition Constant Data from BindingDB
Found 2 hits for monomerid = 354486
LigandPNGBDBM354486(US9796719, Compound 154 | [1-(2-Ethyl-3-{[4- (4-fl...)
Affinity DataIC50:  55nM. Assay description: Compound IC50 values are determined in a hENPP2 (UniProtKB/SwissProt Sequence ref Q13822) biochemical assay using LPC as substrate.5 μL of a dil...
Ligand InfoPC cidPC sid
In DepthDetails US Patent
TargetEctonucleotide pyrophosphatase/phosphodiesterase family member 2(Homo sapiens (Human))
Galapagos
US Patent
LigandPNGBDBM354486(US9796719, Compound 154 | [1-(2-Ethyl-3-{[4- (4-fl...)
Affinity DataIC50: >1.00E+4nM. Assay description: Compound IC50 values are determined in a fluorescent hENPP2 (UniProtKB/SwissProt Sequence ref Q13822) biochemical assay using the fluorogenic autotax...
Ligand InfoPC cidPC sid
In DepthDetails US Patent