BDBM354540 2-(4-(3-((4-(2- cyano-4- fluorophenyl) thiazol-2- yl)(methyl)amino)- 2-ethylimidazo[1,2- b]pyridazin-6- yl)piperidin-1-yl)- N-methylacetamide::US9796719, Compound 209
SMILES CCc1nc2ccc(nn2c1N(C)c1nc(cs1)-c1ccc(F)cc1C#N)C1CCN(CC(=O)NC)CC1
InChI Key InChIKey=DESMYZLASOTSSW-UHFFFAOYSA-N
Data  1 IC50
  Tab Delimited (TSV)   2D SDfile   Computed 3D by Vconf -m prep SDfile
Find this compound or compounds like it in BindingDB:
Activity Spreadsheet -- Enzyme Inhibition Constant Data from BindingDB
Found 1 hit for monomerid = 354540
TargetEctonucleotide pyrophosphatase/phosphodiesterase family member 2(Homo sapiens (Human))
Galapagos
US Patent
LigandPNGBDBM354540(2-(4-(3-((4-(2- cyano-4- fluorophenyl) thiazol-2- ...)
Affinity DataIC50: <1.00E+3nM. Assay description: Compound IC50 values are determined in a fluorescent hENPP2 (UniProtKB/SwissProt Sequence ref Q13822) biochemical assay using the fluorogenic autotax...
Ligand InfoPC cidPC sid
In DepthDetails US Patent