BDBM355886 (S)-1-(5-chloro-6- (2H-1,2,3-triazol-2- yl)pyridin-3-yl)-3-(2- chloro-7-(1- methoxyethyl)pyrazo- lo[1,5-a]pyrimidin-6- yl)urea::US10442808, Example 10::US9815842, Example 10
SMILES CO[C@@H](C)c1c(NC(=O)Nc2cnc(c(Cl)c2)-n2nccn2)cnc2cc(Cl)nn12
InChI Key InChIKey=GBIASRXDYFFUED-VIFPVBQESA-N
Data  18 IC50
  Tab Delimited (TSV)   2D SDfile   Computed 3D by Vconf -m prep SDfile
Find this compound or compounds like it in BindingDB:
Activity Spreadsheet -- Enzyme Inhibition Constant Data from BindingDB
Found 18 hits for monomerid = 355886
TargetMucosa-associated lymphoid tissue lymphoma translocation protein 1(Homo sapiens (Human))
Novartis
US Patent
LigandPNGBDBM355886((S)-1-(5-chloro-6- (2H-1,2,3-triazol-2- yl)pyridin...)
Affinity DataIC50:  0.00200nM. Assay description: IC50 values of test compounds were determined with an enzyme activity assay using the C-domain of MALT1 (amino acids 329-824). The readout parameter ...
In DepthDetails US Patent
TargetMucosa-associated lymphoid tissue lymphoma translocation protein 1(Homo sapiens (Human))
Novartis
US Patent
LigandPNGBDBM355886((S)-1-(5-chloro-6- (2H-1,2,3-triazol-2- yl)pyridin...)
Affinity DataIC50:  6nM. Assay description: Inhibition of MALT1 (unknown origin) by Glosensor reporter gene assay
In DepthDetails ArticlePubMed
TargetMucosa-associated lymphoid tissue lymphoma translocation protein 1(Homo sapiens (Human))
Novartis
US Patent
LigandPNGBDBM355886((S)-1-(5-chloro-6- (2H-1,2,3-triazol-2- yl)pyridin...)
Affinity DataIC50:  3nM. Assay description: Inhibition of MALT1 (unknown origin) using Ac-Trp-Leu-Arg-Ser-Arg^Cys(PT14)-NH2 as substrate preincubated for 60 mins followed by substrate addition ...
In DepthDetails ArticlePubMed
TargetMucosa-associated lymphoid tissue lymphoma translocation protein 1(Homo sapiens (Human))
Novartis
US Patent
LigandPNGBDBM355886((S)-1-(5-chloro-6- (2H-1,2,3-triazol-2- yl)pyridin...)
Affinity DataIC50:  20nM. Assay description: Inhibition of MALT1 in PMA-stimulated human Jurkat T cells assessed as reduction in IL2 level pretreated for 30 mins followed by PMA-stimulation meas...
In DepthDetails ArticlePubMed
TargetMucosa-associated lymphoid tissue lymphoma translocation protein 1(Homo sapiens (Human))
Novartis
US Patent
LigandPNGBDBM355886((S)-1-(5-chloro-6- (2H-1,2,3-triazol-2- yl)pyridin...)
Affinity DataIC50:  500nM. Assay description: Inhibition of MALT1 in human whole blood assessed as reduction in PMA//anti-CD28 antibody-induced IL2 level pre-incubated for 1 hrs before stimulatio...
In DepthDetails ArticlePubMed
TargetCytochrome P450 3A4(Homo sapiens (Human))
Novartis Pharma
Curated by ChEMBL
LigandPNGBDBM355886((S)-1-(5-chloro-6- (2H-1,2,3-triazol-2- yl)pyridin...)
Affinity DataIC50: >2.00E+4nM. Assay description: Inhibition of CYP3A4 (unknown origin)
In DepthDetails ArticlePubMed
TargetCytochrome P450 2C9(Homo sapiens (Human))
Novartis Pharma
Curated by ChEMBL
LigandPNGBDBM355886((S)-1-(5-chloro-6- (2H-1,2,3-triazol-2- yl)pyridin...)
Affinity DataIC50: >2.00E+4nM. Assay description: Inhibition of CYP2C9 (unknown origin)
In DepthDetails ArticlePubMed
TargetCytochrome P450 2D6(Homo sapiens (Human))
Novartis Pharma
Curated by ChEMBL
LigandPNGBDBM355886((S)-1-(5-chloro-6- (2H-1,2,3-triazol-2- yl)pyridin...)
Affinity DataIC50: >2.00E+4nM. Assay description: Inhibition of CYP2D6 (unknown origin)
In DepthDetails ArticlePubMed
TargetMucosa-associated lymphoid tissue lymphoma translocation protein 1(Homo sapiens (Human))
Novartis
US Patent
LigandPNGBDBM355886((S)-1-(5-chloro-6- (2H-1,2,3-triazol-2- yl)pyridin...)
Affinity DataIC50:  40nM. Assay description: Inhibition of MALT1 in human OCILY3 cells by NF-kappaB reporter gene assay
In DepthDetails ArticlePubMed
TargetMucosa-associated lymphoid tissue lymphoma translocation protein 1(Homo sapiens (Human))
Novartis
US Patent
LigandPNGBDBM355886((S)-1-(5-chloro-6- (2H-1,2,3-triazol-2- yl)pyridin...)
Affinity DataIC50:  30nM. Assay description: Inhibition of MALT1 in human OCILY3 cells assessed as reduction in BCL10 cleavage by MSD assay
In DepthDetails ArticlePubMed
TargetCaspase-3(Homo sapiens (Human))
Novartis Pharma
Curated by ChEMBL
LigandPNGBDBM355886((S)-1-(5-chloro-6- (2H-1,2,3-triazol-2- yl)pyridin...)
Affinity DataIC50: >1.00E+5nM. Assay description: Inhibition of caspase-3 (unknown origin)
In DepthDetails ArticlePubMed
TargetCathepsin B(Homo sapiens (Human))
Novartis Pharma
Curated by ChEMBL
LigandPNGBDBM355886((S)-1-(5-chloro-6- (2H-1,2,3-triazol-2- yl)pyridin...)
Affinity DataIC50: >1.00E+5nM. Assay description: Inhibition of cathepsin B (unknown origin)
In DepthDetails ArticlePubMed
TargetDipeptidyl peptidase 1(Homo sapiens (Human))
Novartis Pharma
Curated by ChEMBL
LigandPNGBDBM355886((S)-1-(5-chloro-6- (2H-1,2,3-triazol-2- yl)pyridin...)
Affinity DataIC50: >1.00E+5nM. Assay description: Inhibition of cathepsin C (unknown origin)
In DepthDetails ArticlePubMed
TargetCathepsin K(Homo sapiens (Human))
Novartis Pharma
Curated by ChEMBL
LigandPNGBDBM355886((S)-1-(5-chloro-6- (2H-1,2,3-triazol-2- yl)pyridin...)
Affinity DataIC50: >1.00E+5nM. Assay description: Inhibition of cathepsin K (unknown origin)
In DepthDetails ArticlePubMed
TargetProcathepsin L(Homo sapiens (Human))
Novartis Pharma
Curated by ChEMBL
LigandPNGBDBM355886((S)-1-(5-chloro-6- (2H-1,2,3-triazol-2- yl)pyridin...)
Affinity DataIC50: >1.00E+5nM. Assay description: Inhibition of cathepsin L (unknown origin)
In DepthDetails ArticlePubMed
TargetCathepsin S(Homo sapiens (Human))
Novartis Pharma
Curated by ChEMBL
LigandPNGBDBM355886((S)-1-(5-chloro-6- (2H-1,2,3-triazol-2- yl)pyridin...)
Affinity DataIC50: >1.00E+5nM. Assay description: Inhibition of cathepsin S (unknown origin)
In DepthDetails ArticlePubMed
TargetPotassium voltage-gated channel subfamily H member 2(Homo sapiens (Human))
Novartis Pharma
Curated by ChEMBL
LigandPNGBDBM355886((S)-1-(5-chloro-6- (2H-1,2,3-triazol-2- yl)pyridin...)
Affinity DataIC50: >3.00E+4nM. Assay description: Inhibition of human ERG by dofetilide binding assay
In DepthDetails ArticlePubMed
LigandPNGBDBM355886((S)-1-(5-chloro-6- (2H-1,2,3-triazol-2- yl)pyridin...)
Affinity DataIC50:  0.00200nM. Assay description: The assay employs a short peptide substrate labeled with the single fluorophore PT14 as a fluorescence lifetime probe sensitive to the cleavage state...
In DepthDetails US Patent