BDBM356098 N-(6-((2,5-dioxoimidazolidin-1- yl)methyl)-2-phenylpyridin-3- yl)-2-fluoro-5-(1-methyl-1H- pyrazol-3-yl)-4- (trifluoromethyl)benzamide::US9815846, Compound 98
SMILES Cn1ccc(n1)-c1cc(C(=O)Nc2ccc(CN3C(=O)CNC3=O)nc2-c2ccccc2)c(F)cc1C(F)(F)F
InChI Key InChIKey=FEGICJAYGLCDSB-UHFFFAOYSA-N
Data  1 IC50
  Tab Delimited (TSV)   2D SDfile   Computed 3D by Vconf -m prep SDfile
Find this compound or compounds like it in BindingDB:
Activity Spreadsheet -- Enzyme Inhibition Constant Data from BindingDB
Found 1 hit for monomerid = 356098
TargetHigh affinity nerve growth factor receptor(Homo sapiens (Human))
Merck Sharp & Dohme
US Patent
LigandPNGBDBM356098(N-(6-((2,5-dioxoimidazolidin-1- yl)methyl)-2-pheny...)
Affinity DataIC50:  0.220nM. Assay description: TrkA functional activity was measured using a DiscoverX PathHunter assay. In this assay, U2OS cells express the human TrkA receptor as a fusion with ...
Ligand InfoPC cidPC sid
In DepthDetails US Patent