BDBM356117 N-(2-(2-amino-2-oxoethyl)-4-(o- tolyl)pyrimidin-5-yl)-2-fluoro-5- (1-methyl-1H-pyrazol-3-yl)-4- (trifluoromethyl)benzamide::US9815846, Compound 117
SMILES Cc1ccccc1-c1nc(CC(N)=O)ncc1NC(=O)c1cc(-c2ccn(C)n2)c(cc1F)C(F)(F)F
InChI Key InChIKey=VXZPVVWFYGUBDM-UHFFFAOYSA-N
Data  1 IC50
  Tab Delimited (TSV)   2D SDfile   Computed 3D by Vconf -m prep SDfile
Find this compound or compounds like it in BindingDB:
Activity Spreadsheet -- Enzyme Inhibition Constant Data from BindingDB
Found 1 hit for monomerid = 356117
TargetHigh affinity nerve growth factor receptor(Homo sapiens (Human))
Merck Sharp & Dohme
US Patent
LigandPNGBDBM356117(N-(2-(2-amino-2-oxoethyl)-4-(o- tolyl)pyrimidin-5-...)
Affinity DataIC50:  4.90nM. Assay description: TrkA functional activity was measured using a DiscoverX PathHunter assay. In this assay, U2OS cells express the human TrkA receptor as a fusion with ...
Ligand InfoPC cidPC sid
In DepthDetails US Patent