BDBM356139 US9815846, Compound 139
SMILES Fc1cc(c(cc1C(=O)Nc1cc2C(=O)NCCc2nc1-c1ccccc1)-c1ncccn1)C(F)(F)F
InChI Key InChIKey=GNXNTEXMNULGFJ-UHFFFAOYSA-N
Data  1 IC50
  Tab Delimited (TSV)   2D SDfile   Computed 3D by Vconf -m prep SDfile
Find this compound or compounds like it in BindingDB:
Activity Spreadsheet -- Enzyme Inhibition Constant Data from BindingDB
Found 1 hit for monomerid = 356139
TargetHigh affinity nerve growth factor receptor(Homo sapiens (Human))
Merck Sharp & Dohme
US Patent
LigandPNGBDBM356139(US9815846, Compound 139)
Affinity DataIC50:  1.40nM. Assay description: TrkA functional activity was measured using a DiscoverX PathHunter assay. In this assay, U2OS cells express the human TrkA receptor as a fusion with ...
Ligand InfoPC cidPC sid
In DepthDetails US Patent